{"text_format":"1","workbook":"xlsx","n_sheets":10,"sheets":["Introduction","Template","Dictionary","Version","Formula","Scheme Name","Drop Down","Labels","Mouse Over","Variables"],"not_rendered":{"charts":0,"images":21,"macros":1,"external_links":1,"defined_names":53,"comments":2,"pivot_tables":0},"unopened":[],"bounds":{"document_bytes":16777216,"sheet_cells":100000,"rows_first":2000,"rows_last":500,"rows_between":2000,"halvings":0,"cell_chars":16384,"cell_head_chars":4096},"cells_cut":0,"cells_raw":0,"read":"whole","date_system":"1900"}

{"sheet":"Introduction","index":0,"n_rows":0,"n_cols":0,"rows_kept":0,"cut":false,"hidden":false,"merged":[]}

{"sheet":"Template","index":1,"n_rows":10,"n_cols":35,"rows_kept":10,"cut":false,"hidden":false,"merged":[[7,2,7,5],[2,10,3,14],[5,10,5,14],[0,1,0,3],[1,1,1,2],[2,6,3,9],[5,8,5,9],[5,6,5,7],[0,4,0,5],[2,33,3,35],[4,34,4,35],[6,34,6,35],[2,15,3,29],[2,30,3,32],[5,16,5,17],[5,18,5,19],[5,20,5,21]]}
["Employer Name 僱主名稱"]
["Scheme Name 計劃名稱","Please enter"]
["Contribution Frequency 供款週期","Please enter","The last day of the 'semi-montly' cycle.\n「每半個月」周期的最後一日。\nE.g 15 or 31 etc",null,null,null,"Member Contribution Data (Fill in only when members have contributions to submit)\n成員供款資料（僅在成員有供款要提交時填寫）",null,null,null,"Total Contributions: 0.00",null,null,null,null,"New Member Data (Fill in only for the new member status (N), leave blank for other member status \n新成員資料（僅填寫新成員狀態為（N），其他成員狀態則留空）",null,null,null,null,null,null,null,null,null,null,null,null,null,null,"Termination Data (Fill in only for terminated member status (T), leave blank for other member statuses) \n終止受僱資料（僅填寫終止受僱成員狀態為（T），其他成員狀態則留空  ",null,null,"Error Message\n錯誤訊息"]
["Contribution Period Start Date\n供款期開始日 (YYYY-MM-DD)","Please enter"]
["Payroll Group ID \n工資組別編號","Please enter if the scheme has more than one Payroll Group","ID Type\n身分證明類別","ID No.\n身分證明號碼","Date of Employment\n受僱日期","Staff No.\n職員編號","Member Contribution Period Start Date\n成員供款期開始日期","Member Contribution Period End Date\n成員供款期完結日期","Relevant Income\n有關入息","Basic Salary\n基本薪金","Employer's Mandatory Contributions\n僱主強制性供款","Employee's Mandatory Contributions\n僱員強制性供款","Employer's Voluntary Contributions\n僱主自願性供款",null,"Employee's Voluntary Contributions\n僱員自願性供款 ","Gender\n性別","Surname (English)\n姓氏（英文）","Given Name (English)\n名字（英文）","Surname (Chinese)\n姓氏（中文）","Given Name (Chinese)\n名字（中文）","Date of Birth\n出生日期","Date of Joining the Scheme\n參加計劃日期","Member Class\n成員組別","Commencement Date for \nVesting Entitlement\n享有歸屬權益生效日期","Employee Type\n受僱類型","Previous Date of Employment\n受僱於現僱主集團日期","Visa Issue Date\n簽證簽發日期","Email Address\n電郵地址","Country Code for Mobile Number\n手機號碼的國家代碼","Mobile No.\n手機號碼","Last Date of Employment\n最後受僱日期","Reason of Termination\n離職理由","Long Service Payment/Severance Payment\n長期服務金／遣散費"]
["Employer Account Number\n僱主帳戶號碼","Please enter","HKID - HKID Card 香港身份證\nPassport - Passport 護照","For HKID, please include the check digit, without brackets\n\n對於香港身份證號碼，請包括全部數字，不含括號","YYYY-MM-DD","Maximun 20 characters\n最多20個字符","YYYY-MM-DD",null,"Maximum 18 Numeric characters with 2 decimal places\n最多18個數字字符，保留2位小數位",null,"Maximum 18 Numeric characters with 2 decimal places\n最多18個數字字符，保留2位小數位",null,null,null,null,"\"M\" - Male 男性\n\"F\" - Female 女性\n\"U\" - Unisex 中性\n\"O\" - No Such Information 無相關資訊","Maximum 100 English characters\n最多100個英文字符",null,"Maximum 50 Chinese characters\n最多50個中文字符",null,"YYYY-MM-DD",null,"Maximum 50 English characters\n最多50個英文字符","YYYY-MM-DD","\"NEW\" - New Employee 新僱員\n\"INTRA_GROUP\" - Intra-group Transfer 集團內部轉移\n\"EXEMPT\" - Exempt Person 獲豁免人士\n\"EXPATRIATE\" - Expatriate Employee 外籍員工\n\"EXIST\" - Scheme Transfer 計劃轉移","YYYY-MM-DD","YYYY-MM-DD","Maximum 100 English, numeric or special characters\n最多100個英文字母、數字或特殊字符","Only allow valid Country Code\n只允許有效的國家代碼\ne.g. 852","Maximum 15 numeric characters with no decimal places\n最多15個數字字符，不含小數位","YYYY-MM-DD","\"RESIGN\" - Resignation 辭職                                         \"RETIRE\" - Retirement  退休\n\"EARLY_RETIRE\" - Early Retirement 提早退休             \"DEATH\" - Death 身故\n\"TOTAL_INCAP\" - Total Incapacity 完全喪失行為能力  \"ILL_HEALTH\" - Ill Health 健康問題\n\"REDUNDANCY\" - Redundancy 裁員                            \"LAID_OFF\" - Laid Off 遣散\n\"SUM_DISMISS\" - Summary Dismissal 因故革職          \"DISMIS\" - Dismissal 解僱\n\"CONTRACT_END\" - End of Contract 合約完結","Blank - No LSP/SP offsetting / 沒有長期服務金和遣散費的抵銷\n\"L\" - LSP (Long Service Payment) offsetting/ \nLSP (長期服務金) 抵銷\n\"S\" - SP (Severance Payment) offsetting/ \nSP (遣散費) 抵銷","Upload Result from Error Report\n從錯誤報告中的上載結果","Business Validation Errors (Imported from Error Report of the Bulk Upload Contribution Data in eMPF Platform)\n處理錯誤（來自eMPF平台批量上載供款資料錯誤報告的導入）"]
[]
["You may enter footnotes for reference here\n(Will not upload to Employer Portal)\n\n您可在此輸入供參考的附註\n（不會上載至僱主平台）↓","Blank - Contribution for employee 留空 - 為僱員供款\n\"1. enrol only\" - Enrollment Only 只登記參加計劃\n\"2. enrol n cont\" - Enrollment and First Contribution 登記參加計劃 + 首次供款\n\"3. term only\" - Termination of Employment Only 只終止受僱\n\"4. term n cont\" - Termination of Employment and Final Contribution 終止受僱 + 最後供款\n\"5. cont to term EE\" - Contribution for terminated employee 為已離職僱員供款                                                                                 ","** Important note, please read before filling in the form**\nIf you want to input data for \"contribution for employee\", please leave cell B10 blank and start with cell C10[ ID Type] instead. Otherwise, cell B10 is the first cell you need to select a value in the drop down list \n\n**重要提示，請在填寫表格前閱讀**\n如果你想要輸入「為僱員供款」數據，請將儲存格 B10 留空，並從儲存格 C10[ID 類型] 開始填寫。否則，你需要在儲存格 B10 中從下拉清單中選擇一個選項",null,null,null,null,null,null,null,"Total Contributions: 0.00","Total Contributions: 0.00","Total Contributions: 0.00",null,"Total Contributions: 0.00"]
{"$rows_left_out":3}
{"sheet":"Dictionary","index":2,"n_rows":82,"n_cols":4,"rows_kept":82,"cut":false,"hidden":false,"merged":[[69,0,80,0],[69,1,80,1],[69,3,80,3],[8,0,15,0],[8,1,15,1],[8,3,15,3],[32,2,33,2],[41,0,44,0],[41,1,44,1],[41,3,44,3],[45,2,46,2],[47,2,48,2],[53,0,58,0],[53,1,58,1],[53,3,58,3]]}
["General information 一般資訊"]
["Data Field 資料欄位","Format 格式","Definition 定義","Example 例子"]
["Employer Name\n僱主名稱","Free Text (50)","The name of your company. This field accepts free text with no validation.\n你的公司名稱。此欄位接受自由輸入文字，不進行格式驗證。","ABC Company"]
["Scheme Name\n計劃名稱","Select from dropdown\n從下拉式選單中選擇","The MPF scheme under which contributions are made for this submission. \n本次供款所提交的強積金計劃名稱。","[Scheme Name]"]
["Contribution Frequency\n供款週期","Select from dropdown\n從下拉式選單中選擇","The contribution frequency for this submission.\n本次供款的供款週期。\n\nSelect either \"Monthly\"  or \"Semi-Monthly\" \n請選擇「每月」或「每半月」。","Monthly"]
["Contribution Period Start Date\n供款期開始日","YYYY-MM-DD","The first day of the contribution period.\n供款期的首日。","2026-01-10"]
["Payroll Group ID\n工資組別編號","Letters With Special Characters (20)","This is one of the values employers use to define/ classify specific group(s) of employees, for example, contribution frequency, departments, payroll group and more.\n這是僱主用來定義/分類特定的員工群組的值之一，例如供款頻率、部門、薪資組別等。\n\nThis is the Payroll Group ID of the contribution, but do not enter the Payroll Group Name. To check the Payroll Group ID, go to 'Manage Enrolled Scheme' then 'Payroll Group and Contributions', there is a table lists all the Payroll Group ID.\n這裡需要填寫供款所屬的工資組別編號，請不要輸入工資組別名稱。如需查閱工資組別編號，請前往「管理已參加的計劃」>「工資組別及供款」。頁面上的表格會列出所有工資組別編號。\n\nAllow only English characters, numbers and symbols \"-\" & \"_\".  \n僅允許英文字母、數字 和 符號「-」及「_」。","MLY"]
["Employer Account No.\n僱主帳戶號碼","Numeric (15,0)","A new employer account number will be assigned after the MPF scheme in which your company is participating is onboarded to the eMPF Platform. Employer can log in to the eMPF Platform, and then choose “Manage Scheme” > “Manage Enrolled Scheme” to view the list of enrolled schemes and related account information.\n當你的公司參與的強積金計劃轉移至積金易平台後，你的公司會獲分配一個新的僱主帳戶號碼。僱主可登入積金易平台，然後選擇「管理計劃」 > 「管理已登記計劃」查看已登記計劃列表及相關帳戶資料。","3777463656273"]
{"$rows_left_out":75}
{"sheet":"Version","index":3,"n_rows":2,"n_cols":5,"rows_kept":2,"cut":false,"hidden":false,"merged":[]}
["Version","Date","Amendment"]
["1.0","2026-02-26","Initial Release.",null,"As of 2023/01/16, MPF contributions are calculated according\nto the following tables for \"Regular Employee\":"]

{"sheet":"Formula","index":4,"n_rows":2,"n_cols":5,"rows_kept":2,"cut":false,"hidden":true,"merged":[]}
[null,"Employer's Mandatory Contributions\n僱主強制性供款 Column  K","Employee's Mandatory Contributions\n僱員強制性供款 Column L","Employer's Voluntary Contributions\n僱主自願性供款 Column M","Employee's Voluntary Contributions\n僱員自願性供款 Column O"]
[null,{"$f":"_xlfn.LET(\n  _xlpm.rng, Template!K10:K19378,\n  _xlpm.txt, TRIM(_xlpm.rng&\"\"),\n\n  _xlpm.cap, \"Total Contributions: \",\n  _xlpm.subLbl, \"Total successfully Submitted\",\n  _xlpm.nsubLbl, \"Total unsuccessfully Submitted\",\n\n  _xlpm.showDetail, IFERROR(TRIM(INDIRECT(\"Template!AH10\")&\"\")<>\"\", FALSE),\n\n  _xlpm.isNum, ISNUMBER(_xlpm.rng),\n  _xlpm.leadDigit, IFERROR(--LEFT(_xlpm.txt,1), -1),\n  _xlpm.hasLeadNum, _xlpm.leadDigit>=0,\n\n  _xlpm.sp, IFERROR(FIND(\" \", _xlpm.txt), 1E+99),\n  _xlpm.par, IFERROR(FIND(\"(\", _xlpm.txt), 1E+99),\n  _xlpm.cutPos, IF(_xlpm.sp<_xlpm.par, _xlpm.sp, _xlpm.par),\n  _xlpm.before, LEFT(_xlpm.txt, _xlpm.cutPos-1),\n  _xlpm.numBefore, IFERROR(VALUE(_xlpm.before), 0),\n\n  _xlpm.subPos, IFERROR(SEARCH(\"was submitted\", _xlpm.txt), 0),\n  _xlpm.leftSub, IF(_xlpm.subPos>0, LEFT(_xlpm.txt, _xlpm.subPos), \"\"),\n  _xlpm.parCount, LEN(_xlpm.leftSub)-LEN(SUBSTITUTE(_xlpm.leftSub,\"(\",\"\")),\n  _xlpm.lastParPos, IF(_xlpm.subPos>0,\n                 IF(_xlpm.parCount>0, FIND(\"@\", SUBSTITUTE(_xlpm.leftSub,\"(\", \"@\", _xlpm.parCount)), 0),\n                 0),\n  _xlpm.inParenRaw, IF(_xlpm.lastParPos>0, MID(_xlpm.txt, _xlpm.lastParPos+1, _xlpm.subPos - _xlpm.lastParPos -1), \"\"),\n  _xlpm.inParenTokenPos, FIND(\" \", _xlpm.inParenRaw&\" \"),\n  _xlpm.inParen, LEFT(TRIM(_xlpm.inParenRaw), _xlpm.inParenTokenPos-1),\n  _xlpm.numInParen, IFERROR(VALUE(_xlpm.inParen), 0),\n\n  _xlpm.hasNotSub, ISNUMBER(SEARCH(\"not submitted\", _xlpm.txt)),\n  _xlpm.hasWasSub, _xlpm.subPos>0,\n\n  _xlpm.tot,\n    SUMPRODUCT(\n      IF(_xlpm.txt=\"\",\n        0,\n        IF(_xlpm.isNum,\n          _xlpm.rng,\n          IF(_xlpm.hasLeadNum, _xlpm.numBefore, 0)\n        )\n      )\n    ),\n\n  _xlpm.nsub,\n    SUMPRODUCT(\n      IF(_xlpm.txt=\"\",\n        0,\n        IF(_xlpm.isNum,\n          0,\n          IF(_xlpm.hasNotSub,\n            _xlpm.numBefore,\n            IF(_xlpm.hasWasSub,\n              _xlpm.numBefore-_xlpm.numInParen,\n              0\n            )\n          )\n        )\n      )\n    ),\n\n  _xlpm.sub, _xlpm.tot - _xlpm.nsub,\n\n  _xlpm.totTxt, TEXT(_xlpm.tot,\"#,##0.00\"),\n  _xlpm.nsubTxt, TEXT(_xlpm.nsub,\"#,##0.00\"),\n  _xlpm.subTxt, TEXT(_xlpm.sub,\"#,##0.00\"),\n\n  _xlpm.cap&_xlpm.totTxt&\n    IF(_xlpm.showDetail,\n      CHAR(10)&_xlpm.subLbl&\": \"&_xlpm.subTxt&\n      CHAR(10)&_xlpm.nsubLbl&\": \"&_xlpm.nsubTxt,\n      \"\"\n    )\n)","v":"Total Contributions: 0.00"},{"$f":"_xlfn.LET(\n  _xlpm.rng, Template!L10:L19378,\n  _xlpm.txt, TRIM(_xlpm.rng&\"\"),\n\n  _xlpm.cap, \"Total Contributions: \",\n  _xlpm.subLbl, \"Total successfully Submitted\",\n  _xlpm.nsubLbl, \"Total unsuccessfully Submitted\",\n\n  _xlpm.showDetail, IFERROR(TRIM(INDIRECT(\"Template!AH10\")&\"\")<>\"\", FALSE),\n\n  _xlpm.isNum, ISNUMBER(_xlpm.rng),\n  _xlpm.leadDigit, IFERROR(--LEFT(_xlpm.txt,1), -1),\n  _xlpm.hasLeadNum, _xlpm.leadDigit>=0,\n\n  _xlpm.sp, IFERROR(FIND(\" \", _xlpm.txt), 1E+99),\n  _xlpm.par, IFERROR(FIND(\"(\", _xlpm.txt), 1E+99),\n  _xlpm.cutPos, IF(_xlpm.sp<_xlpm.par, _xlpm.sp, _xlpm.par),\n  _xlpm.before, LEFT(_xlpm.txt, _xlpm.cutPos-1),\n  _xlpm.numBefore, IFERROR(VALUE(_xlpm.before), 0),\n\n  _xlpm.subPos, IFERROR(SEARCH(\"was submitted\", _xlpm.txt), 0),\n  _xlpm.leftSub, IF(_xlpm.subPos>0, LEFT(_xlpm.txt, _xlpm.subPos), \"\"),\n  _xlpm.parCount, LEN(_xlpm.leftSub)-LEN(SUBSTITUTE(_xlpm.leftSub,\"(\",\"\")),\n  _xlpm.lastParPos, IF(_xlpm.subPos>0,\n                 IF(_xlpm.parCount>0, FIND(\"@\", SUBSTITUTE(_xlpm.leftSub,\"(\", \"@\", _xlpm.parCount)), 0),\n                 0),\n  _xlpm.inParenRaw, IF(_xlpm.lastParPos>0, MID(_xlpm.txt, _xlpm.lastParPos+1, _xlpm.subPos - _xlpm.lastParPos -1), \"\"),\n  _xlpm.inParenTokenPos, FIND(\" \", _xlpm.inParenRaw&\" \"),\n  _xlpm.inParen, LEFT(TRIM(_xlpm.inParenRaw), _xlpm.inParenTokenPos-1),\n  _xlpm.numInParen, IFERROR(VALUE(_xlpm.inParen), 0),\n\n  _xlpm.hasNotSub, ISNUMBER(SEARCH(\"not submitted\", _xlpm.txt)),\n  _xlpm.hasWasSub, _xlpm.subPos>0,\n\n  _xlpm.tot,\n    SUMPRODUCT(\n      IF(_xlpm.txt=\"\",\n        0,\n        IF(_xlpm.isNum,\n          _xlpm.rng,\n          IF(_xlpm.hasLeadNum, _xlpm.numBefore, 0)\n        )\n      )\n    ),\n\n  _xlpm.nsub,\n    SUMPRODUCT(\n      IF(_xlpm.txt=\"\",\n        0,\n        IF(_xlpm.isNum,\n          0,\n          IF(_xlpm.hasNotSub,\n            _xlpm.numBefore,\n            IF(_xlpm.hasWasSub,\n              _xlpm.numBefore-_xlpm.numInParen,\n              0\n            )\n          )\n        )\n      )\n    ),\n\n  _xlpm.sub, _xlpm.tot - _xlpm.nsub,\n\n  _xlpm.totTxt, TEXT(_xlpm.tot,\"#,##0.00\"),\n  _xlpm.nsubTxt, TEXT(_xlpm.nsub,\"#,##0.00\"),\n  _xlpm.subTxt, TEXT(_xlpm.sub,\"#,##0.00\"),\n\n  _xlpm.cap&_xlpm.totTxt&\n    IF(_xlpm.showDetail,\n      CHAR(10)&_xlpm.subLbl&\": \"&_xlpm.subTxt&\n      CHAR(10)&_xlpm.nsubLbl&\": \"&_xlpm.nsubTxt,\n      \"\"\n    )\n)","v":"Total Contributions: 0.00"},{"$f":"_xlfn.LET(\n  _xlpm.rng, Template!M10:M19378,\n  _xlpm.txt, TRIM(_xlpm.rng&\"\"),\n\n  _xlpm.cap, \"Total Contributions: \",\n  _xlpm.subLbl, \"Total successfully Submitted\",\n  _xlpm.nsubLbl, \"Total unsuccessfully Submitted\",\n\n  _xlpm.showDetail, IFERROR(TRIM(INDIRECT(\"Template!AH10\")&\"\")<>\"\", FALSE),\n\n  _xlpm.isNum, ISNUMBER(_xlpm.rng),\n  _xlpm.leadDigit, IFERROR(--LEFT(_xlpm.txt,1), -1),\n  _xlpm.hasLeadNum, _xlpm.leadDigit>=0,\n\n  _xlpm.sp, IFERROR(FIND(\" \", _xlpm.txt), 1E+99),\n  _xlpm.par, IFERROR(FIND(\"(\", _xlpm.txt), 1E+99),\n  _xlpm.cutPos, IF(_xlpm.sp<_xlpm.par, _xlpm.sp, _xlpm.par),\n  _xlpm.before, LEFT(_xlpm.txt, _xlpm.cutPos-1),\n  _xlpm.numBefore, IFERROR(VALUE(_xlpm.before), 0),\n\n  _xlpm.subPos, IFERROR(SEARCH(\"was submitted\", _xlpm.txt), 0),\n  _xlpm.leftSub, IF(_xlpm.subPos>0, LEFT(_xlpm.txt, _xlpm.subPos), \"\"),\n  _xlpm.parCount, LEN(_xlpm.leftSub)-LEN(SUBSTITUTE(_xlpm.leftSub,\"(\",\"\")),\n  _xlpm.lastParPos, IF(_xlpm.subPos>0,\n                 IF(_xlpm.parCount>0, FIND(\"@\", SUBSTITUTE(_xlpm.leftSub,\"(\", \"@\", _xlpm.parCount)), 0),\n                 0),\n  _xlpm.inParenRaw, IF(_xlpm.lastParPos>0, MID(_xlpm.txt, _xlpm.lastParPos+1, _xlpm.subPos - _xlpm.lastParPos -1), \"\"),\n  _xlpm.inParenTokenPos, FIND(\" \", _xlpm.inParenRaw&\" \"),\n  _xlpm.inParen, LEFT(TRIM(_xlpm.inParenRaw), _xlpm.inParenTokenPos-1),\n  _xlpm.numInParen, IFERROR(VALUE(_xlpm.inParen), 0),\n\n  _xlpm.hasNotSub, ISNUMBER(SEARCH(\"not submitted\", _xlpm.txt)),\n  _xlpm.hasWasSub, _xlpm.subPos>0,\n\n  _xlpm.tot,\n    SUMPRODUCT(\n      IF(_xlpm.txt=\"\",\n        0,\n        IF(_xlpm.isNum,\n          _xlpm.rng,\n          IF(_xlpm.hasLeadNum, _xlpm.numBefore, 0)\n        )\n      )\n    ),\n\n  _xlpm.nsub,\n    SUMPRODUCT(\n      IF(_xlpm.txt=\"\",\n        0,\n        IF(_xlpm.isNum,\n          0,\n          IF(_xlpm.hasNotSub,\n            _xlpm.numBefore,\n            IF(_xlpm.hasWasSub,\n              _xlpm.numBefore-_xlpm.numInParen,\n              0\n            )\n          )\n        )\n      )\n    ),\n\n  _xlpm.sub, _xlpm.tot - _xlpm.nsub,\n\n  _xlpm.totTxt, TEXT(_xlpm.tot,\"#,##0.00\"),\n  _xlpm.nsubTxt, TEXT(_xlpm.nsub,\"#,##0.00\"),\n  _xlpm.subTxt, TEXT(_xlpm.sub,\"#,##0.00\"),\n\n  _xlpm.cap&_xlpm.totTxt&\n    IF(_xlpm.showDetail,\n      CHAR(10)&_xlpm.subLbl&\": \"&_xlpm.subTxt&\n      CHAR(10)&_xlpm.nsubLbl&\": \"&_xlpm.nsubTxt,\n      \"\"\n    )\n)","v":"Total Contributions: 0.00"},{"$f":"_xlfn.LET(\n  _xlpm.rng, Template!O10:O19378,\n  _xlpm.txt, TRIM(_xlpm.rng&\"\"),\n\n  _xlpm.cap, \"Total Contributions: \",\n  _xlpm.subLbl, \"Total successfully Submitted\",\n  _xlpm.nsubLbl, \"Total unsuccessfully Submitted\",\n\n  _xlpm.showDetail, IFERROR(TRIM(INDIRECT(\"Template!AH10\")&\"\")<>\"\", FALSE),\n\n  _xlpm.isNum, ISNUMBER(_xlpm.rng),\n  _xlpm.leadDigit, IFERROR(--LEFT(_xlpm.txt,1), -1),\n  _xlpm.hasLeadNum, _xlpm.leadDigit>=0,\n\n  _xlpm.sp, IFERROR(FIND(\" \", _xlpm.txt), 1E+99),\n  _xlpm.par, IFERROR(FIND(\"(\", _xlpm.txt), 1E+99),\n  _xlpm.cutPos, IF(_xlpm.sp<_xlpm.par, _xlpm.sp, _xlpm.par),\n  _xlpm.before, LEFT(_xlpm.txt, _xlpm.cutPos-1),\n  _xlpm.numBefore, IFERROR(VALUE(_xlpm.before), 0),\n\n  _xlpm.subPos, IFERROR(SEARCH(\"was submitted\", _xlpm.txt), 0),\n  _xlpm.leftSub, IF(_xlpm.subPos>0, LEFT(_xlpm.txt, _xlpm.subPos), \"\"),\n  _xlpm.parCount, LEN(_xlpm.leftSub)-LEN(SUBSTITUTE(_xlpm.leftSub,\"(\",\"\")),\n  _xlpm.lastParPos, IF(_xlpm.subPos>0,\n                 IF(_xlpm.parCount>0, FIND(\"@\", SUBSTITUTE(_xlpm.leftSub,\"(\", \"@\", _xlpm.parCount)), 0),\n                 0),\n  _xlpm.inParenRaw, IF(_xlpm.lastParPos>0, MID(_xlpm.txt, _xlpm.lastParPos+1, _xlpm.subPos - _xlpm.lastParPos -1), \"\"),\n  _xlpm.inParenTokenPos, FIND(\" \", _xlpm.inParenRaw&\" \"),\n  _xlpm.inParen, LEFT(TRIM(_xlpm.inParenRaw), _xlpm.inParenTokenPos-1),\n  _xlpm.numInParen, IFERROR(VALUE(_xlpm.inParen), 0),\n\n  _xlpm.hasNotSub, ISNUMBER(SEARCH(\"not submitted\", _xlpm.txt)),\n  _xlpm.hasWasSub, _xlpm.subPos>0,\n\n  _xlpm.tot,\n    SUMPRODUCT(\n      IF(_xlpm.txt=\"\",\n        0,\n        IF(_xlpm.isNum,\n          _xlpm.rng,\n          IF(_xlpm.hasLeadNum, _xlpm.numBefore, 0)\n        )\n      )\n    ),\n\n  _xlpm.nsub,\n    SUMPRODUCT(\n      IF(_xlpm.txt=\"\",\n        0,\n        IF(_xlpm.isNum,\n          0,\n          IF(_xlpm.hasNotSub,\n            _xlpm.numBefore,\n            IF(_xlpm.hasWasSub,\n              _xlpm.numBefore-_xlpm.numInParen,\n              0\n            )\n          )\n        )\n      )\n    ),\n\n  _xlpm.sub, _xlpm.tot - _xlpm.nsub,\n\n  _xlpm.totTxt, TEXT(_xlpm.tot,\"#,##0.00\"),\n  _xlpm.nsubTxt, TEXT(_xlpm.nsub,\"#,##0.00\"),\n  _xlpm.subTxt, TEXT(_xlpm.sub,\"#,##0.00\"),\n\n  _xlpm.cap&_xlpm.totTxt&\n    IF(_xlpm.showDetail,\n      CHAR(10)&_xlpm.subLbl&\": \"&_xlpm.subTxt&\n      CHAR(10)&_xlpm.nsubLbl&\": \"&_xlpm.nsubTxt,\n      \"\"\n    )\n)","v":"Total Contributions: 0.00"}]

{"sheet":"Scheme Name","index":5,"n_rows":24,"n_cols":3,"rows_kept":24,"cut":false,"hidden":true,"merged":[]}
["AIA MPF - Prime Value Choice  友邦強積金優選計劃","友邦強積金優選計劃","MT00172"]
["AMTD MPF Scheme  AMTD 強積金計劃","AMTD 強積金計劃","MT00539"]
["BCOM Joyful Retirement MPF Scheme  交通銀行愉盈退休強積金計劃","交通銀行愉盈退休強積金計劃","MT00393"]
["BCT (MPF) Industry Choice  BCT(強積金)行業計劃","BCT(強積金)行業計劃","IS00017"]
["BCT (MPF) Pro Choice  BCT 積金之選","BCT 積金之選","MT00016"]
["BCT Strategic MPF Scheme  BCT強積金策略計劃","BCT強積金策略計劃","MT00075"]
["BEA (MPF) Industry Scheme  東亞(強積金)行業計劃","東亞(強積金)行業計劃","IS00025"]
["BEA (MPF) Master Trust Scheme  東亞(強積金)集成信託計劃","東亞(強積金)集成信託計劃","MT00202"]
{"$rows_left_out":17}
{"sheet":"Drop Down","index":6,"n_rows":13,"n_cols":8,"rows_kept":13,"cut":false,"hidden":true,"merged":[]}
[]
[null,null,null,null,null,null,null,"Contribution Period Start Date\n供款期開始日 (YYYY-MM-DD)"]
[null,null,"HKID","M","NEW","RESIGN","L","Monthly"]
[null,"1. enrol only","Passport","F","INTRA_GROUP","RETIRE","S","Semi-Monthly"]
[null,"2. enrol n cont",null,"U","EXEMPT","EARLY_RETIRE"]
[null,"3. term only",null,"O","EXPATRIATE","DEATH"]
[null,"4. term n cont",null,null,"EXIST","ILL_HEALTH"]
[null,"5. cont to term EE",null,null,null,"TOTAL_INCAP"]
{"$rows_left_out":6}
{"sheet":"Labels","index":7,"n_rows":33,"n_cols":26,"rows_kept":33,"cut":false,"hidden":true,"merged":[]}
["Row 7","Row 7",null,null,null,null,"Header","Header",null,"Contribution Frequence",null,null,"Column 6 Labels",null,null,"Import Message",null,null,"Output Message",null,null,"LSP/SP Warning",null,null,"C3 - Label for End_Date_Semi_Monthly"]
["Chinese","English",null,null,null,null,"Chinese","English",null,"Chinese","English",null,"Chinese","English",null,"Chinese","English",null,"Chinese","English/Chinese",null,"Chinese","English/Chinese",null,"Chinese","English"]
["留空 - 為僱員供款\n\"enrol only\" - 只登記參加計劃\n\"enrol n cont - 登記參加計劃 + 首次供款\n\"term only\" - 只終止受僱\n\"term n cont\" - 終止受僱 + 最後供款\n\"cont with DOE\" - 按受僱日期為僱員供款","blank - Contribution for employee\n\"enrol only\" - Enrollment Only\n\"enrol n cont\" - Enrollment and First Contribution\n\"term only\" - Termination of Employment Only\n\"term n cont\" - Termination of Employment and Final Contribution\n\"cont with DOE\" - Contribution for employee using Date of Employment",null,null,null,null,"僱主名稱","Employer Name",null,"每月","Monthly","C","hkid - HKID Card\npassport - Passport","hkid - 香港身份證\npassport - 護照",null,"請確保「Template」工作表上的所有資料已儲存。匯入的資料將會覆寫所有現有資料。","Please ensure all data on the “Template” sheet is saved. Imported data will overwrite all existing data.",null,"請先更正所有錯誤，再輸出 CSV。","Please correct all errors before clicking \"Output csv\"\n\n請先更正所有錯誤，再按[輸出 CSV]。",null,"你已申請 LSP/SP 對沖，必須完成 LSP/SP 對沖流程以提供更多詳細資訊，請通過 eMPF 平台進行。","The LSP/SP offset request has been entered. If you plan to submit this file to the eMPF Platform, please provide the necessary supporting documents to the eMPF Platform so the offset can be processed.\n\nLSP/SP 抵銷申請已輸入。如您打算將此檔案提交至 eMPF 平台，請向 eMPF 平台提供所需的證明文件，以便進行抵銷處理。",null,"「每半個月」周期的最後一日。","The last day of the 'semi-montly' cycle."]
["身分證明類別","ID Type",null,null,null,null,"計劃名稱","Scheme Name",null,"每半個月","Semi-Monthly","D"]
["身分證明號碼","ID No.",null,null,null,null,"供款週期","Contirbution Frequency",null,null,null,"E","YYYY-MM-DD","YYYY-MM-DD"]
["受僱日期","Date of Employment",null,null,null,null,"供款期","Contribution Period",null,null,null,"F","Maximun 20 English or numeric characters with no decimal places\n","最多20個英文字母或數字字符，不含小數位"]
["職員編號","Staff No.",null,null,null,null,"工資組別編號","Payroll Group ID",null,null,null,"G","YYYY-MM-DD","YYYY-MM-DD"]
["工資供款期開始日期","Payroll Contribution Period Start Date",null,null,null,null,"僱主帳戶號碼","Employer Account Number",null,null,null,"H","YYYY-MM-DD","YYYY-MM-DD"]
{"$rows_left_out":26}
{"sheet":"Mouse Over","index":8,"n_rows":38,"n_cols":4,"rows_kept":38,"cut":false,"hidden":true,"merged":[]}
[null,null,"Chinese","English"]
["Employer Name","僱主名稱","僅供參考。","For reference only."]
["Scheme Name","計劃名稱","請從下拉清單中選取您的計劃名稱。","Please select your scheme name from the pull down list."]
["Contirbution Frequency","供款週期","請從下拉選單中選擇供款週期（每月或每半個月）","Select the contribution frequency (monthly or semi-monthly) from the drop-down menu."]
["Contribution Period","供款期","請輸入供款週期的開始日期。例如，若供款期為 2025-06-01 至 2025-06-30，則請輸入 2025-06-01。","Enter the start date of the contribution period. For example, if the period runs from 2025-06-01 to 2025-06-30, you should enter 2025-06-01."]
["Payroll Group ID","工資組別編號","這裡需要填寫供款所屬的工資組別編號，請不要輸入工資組別名稱。如需查閱工資組別編號，請前往「管理已參加的計劃」>「工資組別及供款」。頁面上的表格會列出所有工資組別編號。","This is the Payroll Group ID of the contribution, but do not enter the Payroll Group Name. To check the Payroll Group ID, go to 'Manage Enrolled Scheme' then 'Payroll Group and Contributions', there is a table lists all the Payroll Group ID."]
["Employer Account Number","僱主帳戶號碼","當你的公司參與的強積金計劃轉移至積金易平台後，你的公司會獲分配一個新的僱主帳戶號碼。僱主可登入積金易平台，然後選擇「管理計劃」 > 「管理已登記計劃」查看已登記計劃列表及相關帳戶資料。","A new employer account number will be assigned after the MPF scheme in which your company is participating is onboarded to the eMPF Platform. Employer can log in to the eMPF Platform, and then choose “Manage Scheme” > “Manage Enrolled Scheme” to view the list of enrolled schemes and related account information."]
["blank - Contribution for employee\n\"new\" - Enrollment and First Contribution\n\"new only\" - Enrollment Only\n\"term\" - Termination of Employment and Final Contribution\n\"term only\" - Termination of Employment Only\n\"cont with DOE\" - Contribution for employee using Date of Employment","留空 - 為僱員供款\n\"new\" - 登記參加計劃 + 首次供款\n\"new only\" - 只登記參加計劃\n\"term\" - 終止受僱 + 最後供款\n\"term only\" - 只終止受僱\n\"cont with DOE\" - 按受僱日期為僱員供款","僅在員工於同一計劃及工資組別內擁有多於一項在職受僱記錄，或該員工已經終止受僱時，方可使用「cont with DOE」（按受僱日期供款）。","Using \"cont with DOE\" (Contribution for employee using Date of Employment) only if the employee has more than one active employment in the same scheme and Payroll Group, or the employee is already terminated."]
{"$rows_left_out":31}
{"sheet":"Variables","index":9,"n_rows":6,"n_cols":2,"rows_kept":6,"cut":false,"hidden":true,"merged":[]}
["Monthly Minimum RI",7100]
["Monthly Maximum RI",30000]
["Monthly Maximum MC",1500]
["Weekly Minimum RI",1960]
["Weekly Maximum RI",7000]
["Weekly Maximum MC",350]